{"text_format":"3","workbook":"xlsx","n_sheets":7,"sheets":["Sheet1","Sheet2","Sheet3","uniform","triangular","epanechnikov","gaussian"],"read":"whole","date_system":"1900"}

{"sheet":"Sheet1","index":0,"n_rows":0,"n_cols":0,"rows_kept":0}

{"sheet":"Sheet2","index":1,"n_rows":0,"n_cols":0,"rows_kept":0}

{"sheet":"Sheet3","index":2,"n_rows":0,"n_cols":0,"rows_kept":0}

{"sheet":"uniform","index":3,"n_rows":30,"n_cols":29,"rows_kept":30}
[100,80,0,80,100,0,80,100,0,80,100,0,80,100,0,null,{"$f":"IF(((A1-C1)-(A6-C6))<0,\"+\",IF(((A1-C1)-(A6-C6))=0,\"o\",\"-\"))","v":"-"},null,null,{"$f":"IF(((D1-F1)-(D6-F6))<0,\"+\",IF(((D1-F1)-(D6-F6))=0,\"o\",\"-\"))","v":"-"},null,null,{"$f":"IF(((G1-I1)-(G6-I6))<0,\"+\",IF(((G1-I1)-(G6-I6))=0,\"o\",\"-\"))","v":"-"},null,null,{"$f":"IF(((J1-L1)-(J6-L6))<0,\"+\",IF(((J1-L1)-(J6-L6))=0,\"o\",\"-\"))","v":"-"},null,null,{"$f":"IF(((M1-O1)-(M6-O6))<0,\"+\",IF(((M1-O1)-(M6-O6))=0,\"o\",\"-\"))","v":"-"}]
[60,120,0,60,120,0,60,120,0,60,120,0,60,120,0,null,{"$f":"IF(((A2-C2)-(A7-C7))<0,\"+\",IF(((A2-C2)-(A7-C7))=0,\"o\",\"-\"))","v":"-"},null,null,{"$f":"IF(((D2-F2)-(D7-F7))<0,\"+\",IF(((D2-F2)-(D7-F7))=0,\"o\",\"-\"))","v":"-"},null,null,{"$f":"IF(((G2-I2)-(G7-I7))<0,\"+\",IF(((G2-I2)-(G7-I7))=0,\"o\",\"-\"))","v":"-"},null,null,{"$f":"IF(((J2-L2)-(J7-L7))<0,\"+\",IF(((J2-L2)-(J7-L7))=0,\"o\",\"-\"))","v":"-"},null,null,{"$f":"IF(((M2-O2)-(M7-O7))<0,\"+\",IF(((M2-O2)-(M7-O7))=0,\"o\",\"-\"))","v":"-"}]
[80,100,0,60,120,0,60,120,0,60,120,0,60,120,0,null,"-",null,null,"-",null,null,"-",null,null,"-",null,null,"-"]
[80,100,0,60,120,0,60,120,0,60,120,0,60,120,0,null,"-",null,null,"-",null,null,"-",null,null,"-",null,null,"-"]
[80,100,0,60,120,0,60,120,0,60,120,0,60,120,0,null,"-",null,null,"-",null,null,"-",null,null,"-",null,null,"-"]
[0,160,20,60,120,0,60,120,0,60,120,0,60,120,0]
[0,100,80,0,160,20,0,160,20,0,160,20,0,160,20]
[0,80,100,0,60,120,0,60,120,0,60,120,0,60,120]
[0,80,100,0,60,120,0,60,120,0,60,120,0,60,120]
[0,80,100,0,60,120,0,60,120,0,60,120,0,60,120]
[60,120,0,60,120,0,60,120,0,60,120,0,60,120,0,null,{"$f":"IF(((A11-C11)-(A16-C16))<0,\"+\",IF(((A11-C11)-(A16-C16))=0,\"o\",\"-\"))","v":"-"},null,null,{"$f":"IF(((D11-F11)-(D16-F16))<0,\"+\",IF(((D11-F11)-(D16-F16))=0,\"o\",\"-\"))","v":"-"},null,null,{"$f":"IF(((G11-I11)-(G16-I16))<0,\"+\",IF(((G11-I11)-(G16-I16))=0,\"o\",\"-\"))","v":"-"},null,null,{"$f":"IF(((J11-L11)-(J16-L16))<0,\"+\",IF(((J11-L11)-(J16-L16))=0,\"o\",\"-\"))","v":"-"},null,null,{"$f":"IF(((M11-O11)-(M16-O16))<0,\"+\",IF(((M11-O11)-(M16-O16))=0,\"o\",\"-\"))","v":"-"}]
[0,180,0,0,180,0,0,180,0,0,180,0,0,180,0,null,{"$f":"IF(((A12-C12)-(A17-C17))<0,\"+\",IF(((A12-C12)-(A17-C17))=0,\"o\",\"-\"))","v":"o"},null,null,{"$f":"IF(((D12-F12)-(D17-F17))<0,\"+\",IF(((D12-F12)-(D17-F17))=0,\"o\",\"-\"))","v":"o"},null,null,{"$f":"IF(((G12-I12)-(G17-I17))<0,\"+\",IF(((G12-I12)-(G17-I17))=0,\"o\",\"-\"))","v":"o"},null,null,{"$f":"IF(((J12-L12)-(J17-L17))<0,\"+\",IF(((J12-L12)-(J17-L17))=0,\"o\",\"-\"))","v":"o"},null,null,{"$f":"IF(((M12-O12)-(M17-O17))<0,\"+\",IF(((M12-O12)-(M17-O17))=0,\"o\",\"-\"))","v":"o"}]
[0,180,0,0,180,0,0,180,0,0,180,0,0,180,0,null,"-",null,null,"-",null,null,"-",null,null,"-",null,null,"-"]
[0,180,0,0,180,0,0,180,0,0,180,0,0,180,0,null,"-",null,null,"-",null,null,"-",null,null,"-",null,null,"-"]
[0,180,0,0,180,0,0,180,0,0,180,0,0,180,0,null,"-",null,null,"-",null,null,"-",null,null,"-",null,null,"-"]
[0,180,0,0,180,0,0,180,0,0,180,0,0,180,0]
[0,180,0,0,180,0,0,180,0,0,180,0,0,180,0]
[0,160,20,0,160,20,0,160,20,0,160,20,0,160,20]
[0,160,20,0,160,20,0,160,20,0,160,20,0,160,20]
[0,160,20,0,160,20,0,160,20,0,160,20,0,160,20]
[100,80,0,80,100,0,80,100,0,80,100,0,80,100,0,null,{"$f":"IF(((A21-C21)-(A26-C26))<0,\"+\",IF(((A21-C21)-(A26-C26))=0,\"o\",\"-\"))","v":"-"},null,null,{"$f":"IF(((D21-F21)-(D26-F26))<0,\"+\",IF(((D21-F21)-(D26-F26))=0,\"o\",\"-\"))","v":"-"},null,null,{"$f":"IF(((G21-I21)-(G26-I26))<0,\"+\",IF(((G21-I21)-(G26-I26))=0,\"o\",\"-\"))","v":"-"},null,null,{"$f":"IF(((J21-L21)-(J26-L26))<0,\"+\",IF(((J21-L21)-(J26-L26))=0,\"o\",\"-\"))","v":"-"},null,null,{"$f":"IF(((M21-O21)-(M26-O26))<0,\"+\",IF(((M21-O21)-(M26-O26))=0,\"o\",\"-\"))","v":"-"}]
[60,120,0,60,120,0,60,120,0,60,120,0,60,120,0,null,{"$f":"IF(((A22-C22)-(A27-C27))<0,\"+\",IF(((A22-C22)-(A27-C27))=0,\"o\",\"-\"))","v":"-"},null,null,{"$f":"IF(((D22-F22)-(D27-F27))<0,\"+\",IF(((D22-F22)-(D27-F27))=0,\"o\",\"-\"))","v":"-"},null,null,{"$f":"IF(((G22-I22)-(G27-I27))<0,\"+\",IF(((G22-I22)-(G27-I27))=0,\"o\",\"-\"))","v":"-"},null,null,{"$f":"IF(((J22-L22)-(J27-L27))<0,\"+\",IF(((J22-L22)-(J27-L27))=0,\"o\",\"-\"))","v":"-"},null,null,{"$f":"IF(((M22-O22)-(M27-O27))<0,\"+\",IF(((M22-O22)-(M27-O27))=0,\"o\",\"-\"))","v":"-"}]
[80,100,0,60,120,0,60,120,0,60,120,0,60,120,0,null,"-",null,null,"-",null,null,"-",null,null,"-",null,null,"-"]
[80,100,0,60,120,0,60,120,0,60,120,0,60,120,0,null,"-",null,null,"-",null,null,"-",null,null,"-",null,null,"-"]
[80,100,0,60,120,0,60,120,0,60,120,0,60,120,0,null,"-",null,null,"-",null,null,"-",null,null,"-",null,null,"-"]
[0,160,20,60,120,0,60,120,0,60,120,0,60,120,0]
[0,100,80,0,160,20,0,160,20,0,160,20,0,160,20]
[0,80,100,0,60,120,0,60,120,0,60,120,0,60,120]
[0,80,100,0,60,120,0,60,120,0,60,120,0,60,120]
[0,80,100,0,60,120,0,60,120,0,60,120,0,60,120]

{"sheet":"triangular","index":4,"n_rows":30,"n_cols":29,"rows_kept":30}
[60,120,0,40,140,0,40,140,0,40,140,0,40,140,0,null,{"$f":"IF(((A1-C1)-(A6-C6))<0,\"+\",IF(((A1-C1)-(A6-C6))=0,\"o\",\"-\"))","v":"o"},null,null,{"$f":"IF(((D1-F1)-(D6-F6))<0,\"+\",IF(((D1-F1)-(D6-F6))=0,\"o\",\"-\"))","v":"-"},null,null,{"$f":"IF(((G1-I1)-(G6-I6))<0,\"+\",IF(((G1-I1)-(G6-I6))=0,\"o\",\"-\"))","v":"-"},null,null,{"$f":"IF(((J1-L1)-(J6-L6))<0,\"+\",IF(((J1-L1)-(J6-L6))=0,\"o\",\"-\"))","v":"-"},null,null,{"$f":"IF(((M1-O1)-(M6-O6))<0,\"+\",IF(((M1-O1)-(M6-O6))=0,\"o\",\"-\"))","v":"-"}]
[20,160,0,0,180,0,0,180,0,0,180,0,0,180,0,null,{"$f":"IF(((A2-C2)-(A7-C7))<0,\"+\",IF(((A2-C2)-(A7-C7))=0,\"o\",\"-\"))","v":"-"},null,null,{"$f":"IF(((D2-F2)-(D7-F7))<0,\"+\",IF(((D2-F2)-(D7-F7))=0,\"o\",\"-\"))","v":"o"},null,null,{"$f":"IF(((G2-I2)-(G7-I7))<0,\"+\",IF(((G2-I2)-(G7-I7))=0,\"o\",\"-\"))","v":"o"},null,null,{"$f":"IF(((J2-L2)-(J7-L7))<0,\"+\",IF(((J2-L2)-(J7-L7))=0,\"o\",\"-\"))","v":"o"},null,null,{"$f":"IF(((M2-O2)-(M7-O7))<0,\"+\",IF(((M2-O2)-(M7-O7))=0,\"o\",\"-\"))","v":"o"}]
[20,160,0,0,180,0,0,180,0,0,180,0,0,180,0,null,"-",null,null,"-",null,null,"-",null,null,"-",null,null,"-"]
[20,160,0,0,180,0,0,180,0,0,180,0,0,180,0,null,"-",null,null,"o",null,null,"o",null,null,"o",null,null,"o"]
[20,160,0,0,180,0,0,180,0,0,180,0,0,180,0,null,"-",null,null,"-",null,null,"-",null,null,"-",null,null,"-"]
[60,120,0,0,180,0,0,180,0,0,180,0,0,180,0]
[0,180,0,0,180,0,0,180,0,0,180,0,0,180,0]
[0,140,40,0,160,20,0,160,20,0,160,20,0,160,20]
[0,60,120,0,180,0,0,180,0,0,180,0,0,180,0]
[0,140,40,0,160,20,0,160,20,0,160,20,0,160,20]
[0,180,0,0,180,0,0,180,0,0,180,0,0,180,0,null,{"$f":"IF(((A11-C11)-(A16-C16))<0,\"+\",IF(((A11-C11)-(A16-C16))=0,\"o\",\"-\"))","v":"o"},null,null,{"$f":"IF(((D11-F11)-(D16-F16))<0,\"+\",IF(((D11-F11)-(D16-F16))=0,\"o\",\"-\"))","v":"o"},null,null,{"$f":"IF(((G11-I11)-(G16-I16))<0,\"+\",IF(((G11-I11)-(G16-I16))=0,\"o\",\"-\"))","v":"o"},null,null,{"$f":"IF(((J11-L11)-(J16-L16))<0,\"+\",IF(((J11-L11)-(J16-L16))=0,\"o\",\"-\"))","v":"o"},null,null,{"$f":"IF(((M11-O11)-(M16-O16))<0,\"+\",IF(((M11-O11)-(M16-O16))=0,\"o\",\"-\"))","v":"o"}]
[0,180,0,0,180,0,0,180,0,0,180,0,0,180,0,null,{"$f":"IF(((A12-C12)-(A17-C17))<0,\"+\",IF(((A12-C12)-(A17-C17))=0,\"o\",\"-\"))","v":"o"},null,null,{"$f":"IF(((D12-F12)-(D17-F17))<0,\"+\",IF(((D12-F12)-(D17-F17))=0,\"o\",\"-\"))","v":"o"},null,null,{"$f":"IF(((G12-I12)-(G17-I17))<0,\"+\",IF(((G12-I12)-(G17-I17))=0,\"o\",\"-\"))","v":"o"},null,null,{"$f":"IF(((J12-L12)-(J17-L17))<0,\"+\",IF(((J12-L12)-(J17-L17))=0,\"o\",\"-\"))","v":"o"},null,null,{"$f":"IF(((M12-O12)-(M17-O17))<0,\"+\",IF(((M12-O12)-(M17-O17))=0,\"o\",\"-\"))","v":"o"}]
[0,180,0,0,180,0,0,180,0,0,180,0,0,180,0,null,"o",null,null,"o",null,null,"o",null,null,"o",null,null,"o"]
[0,180,0,0,180,0,0,180,0,0,180,0,0,180,0,null,"o",null,null,"o",null,null,"o",null,null,"o",null,null,"o"]
[0,180,0,0,180,0,0,180,0,0,180,0,0,180,0,null,"o",null,null,"o",null,null,"o",null,null,"o",null,null,"o"]
[0,180,0,0,180,0,0,180,0,0,180,0,0,180,0]
[0,180,0,0,180,0,0,180,0,0,180,0,0,180,0]
[0,180,0,0,180,0,0,180,0,0,180,0,0,180,0]
[0,180,0,0,180,0,0,180,0,0,180,0,0,180,0]
[0,180,0,0,180,0,0,180,0,0,180,0,0,180,0]
[60,120,0,40,140,0,40,140,0,40,140,0,40,140,0,null,{"$f":"IF(((A21-C21)-(A26-C26))<0,\"+\",IF(((A21-C21)-(A26-C26))=0,\"o\",\"-\"))","v":"o"},null,null,{"$f":"IF(((D21-F21)-(D26-F26))<0,\"+\",IF(((D21-F21)-(D26-F26))=0,\"o\",\"-\"))","v":"-"},null,null,{"$f":"IF(((G21-I21)-(G26-I26))<0,\"+\",IF(((G21-I21)-(G26-I26))=0,\"o\",\"-\"))","v":"-"},null,null,{"$f":"IF(((J21-L21)-(J26-L26))<0,\"+\",IF(((J21-L21)-(J26-L26))=0,\"o\",\"-\"))","v":"-"},null,null,{"$f":"IF(((M21-O21)-(M26-O26))<0,\"+\",IF(((M21-O21)-(M26-O26))=0,\"o\",\"-\"))","v":"-"}]
[20,160,0,0,180,0,0,180,0,0,180,0,0,180,0,null,{"$f":"IF(((A22-C22)-(A27-C27))<0,\"+\",IF(((A22-C22)-(A27-C27))=0,\"o\",\"-\"))","v":"-"},null,null,{"$f":"IF(((D22-F22)-(D27-F27))<0,\"+\",IF(((D22-F22)-(D27-F27))=0,\"o\",\"-\"))","v":"o"},null,null,{"$f":"IF(((G22-I22)-(G27-I27))<0,\"+\",IF(((G22-I22)-(G27-I27))=0,\"o\",\"-\"))","v":"o"},null,null,{"$f":"IF(((J22-L22)-(J27-L27))<0,\"+\",IF(((J22-L22)-(J27-L27))=0,\"o\",\"-\"))","v":"o"},null,null,{"$f":"IF(((M22-O22)-(M27-O27))<0,\"+\",IF(((M22-O22)-(M27-O27))=0,\"o\",\"-\"))","v":"o"}]
[20,160,0,0,180,0,0,180,0,0,180,0,0,180,0,null,"-",null,null,"-",null,null,"-",null,null,"-",null,null,"-"]
[20,160,0,0,180,0,0,180,0,0,180,0,0,180,0,null,"-",null,null,"o",null,null,"o",null,null,"o",null,null,"o"]
[20,160,0,0,180,0,0,180,0,0,180,0,0,180,0,null,"-",null,null,"-",null,null,"-",null,null,"-",null,null,"-"]
[60,120,0,0,180,0,0,180,0,0,180,0,0,180,0]
[0,180,0,0,180,0,0,180,0,0,180,0,0,180,0]
[0,140,40,0,160,20,0,160,20,0,160,20,0,160,20]
[0,60,120,0,180,0,0,180,0,0,180,0,0,180,0]
[0,140,40,0,160,20,0,160,20,0,160,20,0,160,20]

{"sheet":"epanechnikov","index":5,"n_rows":30,"n_cols":29,"rows_kept":30}
[100,80,0,40,140,0,40,140,0,40,140,0,40,140,0,null,{"$f":"IF(((A1-C1)-(A6-C6))<0,\"+\",IF(((A1-C1)-(A6-C6))=0,\"o\",\"-\"))","v":"-"},null,null,{"$f":"IF(((D1-F1)-(D6-F6))<0,\"+\",IF(((D1-F1)-(D6-F6))=0,\"o\",\"-\"))","v":"-"},null,null,{"$f":"IF(((G1-I1)-(G6-I6))<0,\"+\",IF(((G1-I1)-(G6-I6))=0,\"o\",\"-\"))","v":"-"},null,null,{"$f":"IF(((J1-L1)-(J6-L6))<0,\"+\",IF(((J1-L1)-(J6-L6))=0,\"o\",\"-\"))","v":"-"},null,null,{"$f":"IF(((M1-O1)-(M6-O6))<0,\"+\",IF(((M1-O1)-(M6-O6))=0,\"o\",\"-\"))","v":"-"}]
[80,100,0,0,180,0,0,180,0,0,180,0,0,180,0,null,{"$f":"IF(((A2-C2)-(A7-C7))<0,\"+\",IF(((A2-C2)-(A7-C7))=0,\"o\",\"-\"))","v":"-"},null,null,{"$f":"IF(((D2-F2)-(D7-F7))<0,\"+\",IF(((D2-F2)-(D7-F7))=0,\"o\",\"-\"))","v":"o"},null,null,{"$f":"IF(((G2-I2)-(G7-I7))<0,\"+\",IF(((G2-I2)-(G7-I7))=0,\"o\",\"-\"))","v":"o"},null,null,{"$f":"IF(((J2-L2)-(J7-L7))<0,\"+\",IF(((J2-L2)-(J7-L7))=0,\"o\",\"-\"))","v":"o"},null,null,{"$f":"IF(((M2-O2)-(M7-O7))<0,\"+\",IF(((M2-O2)-(M7-O7))=0,\"o\",\"-\"))","v":"o"}]
[80,100,0,0,180,0,0,180,0,0,180,0,0,180,0,null,"-",null,null,"-",null,null,"-",null,null,"-",null,null,"-"]
[80,100,0,0,180,0,0,180,0,0,180,0,0,180,0,null,"-",null,null,"o",null,null,"o",null,null,"o",null,null,"o"]
[80,100,0,0,180,0,0,180,0,0,180,0,0,180,0,null,"-",null,null,"-",null,null,"-",null,null,"-",null,null,"-"]
[80,80,20,0,180,0,0,180,0,0,180,0,0,180,0]
[0,60,120,0,180,0,0,180,0,0,180,0,0,180,0]
[0,60,120,0,160,20,0,160,20,0,160,20,0,160,20]
[0,60,120,0,180,0,0,180,0,0,180,0,0,180,0]
[0,60,120,0,160,20,0,160,20,0,160,20,0,160,20]
[40,140,0,0,180,0,0,180,0,0,180,0,0,180,0,null,{"$f":"IF(((A11-C11)-(A16-C16))<0,\"+\",IF(((A11-C11)-(A16-C16))=0,\"o\",\"-\"))","v":"-"},null,null,{"$f":"IF(((D11-F11)-(D16-F16))<0,\"+\",IF(((D11-F11)-(D16-F16))=0,\"o\",\"-\"))","v":"o"},null,null,{"$f":"IF(((G11-I11)-(G16-I16))<0,\"+\",IF(((G11-I11)-(G16-I16))=0,\"o\",\"-\"))","v":"o"},null,null,{"$f":"IF(((J11-L11)-(J16-L16))<0,\"+\",IF(((J11-L11)-(J16-L16))=0,\"o\",\"-\"))","v":"o"},null,null,{"$f":"IF(((M11-O11)-(M16-O16))<0,\"+\",IF(((M11-O11)-(M16-O16))=0,\"o\",\"-\"))","v":"o"}]
[0,180,0,0,180,0,0,180,0,0,180,0,0,180,0,null,{"$f":"IF(((A12-C12)-(A17-C17))<0,\"+\",IF(((A12-C12)-(A17-C17))=0,\"o\",\"-\"))","v":"o"},null,null,{"$f":"IF(((D12-F12)-(D17-F17))<0,\"+\",IF(((D12-F12)-(D17-F17))=0,\"o\",\"-\"))","v":"o"},null,null,{"$f":"IF(((G12-I12)-(G17-I17))<0,\"+\",IF(((G12-I12)-(G17-I17))=0,\"o\",\"-\"))","v":"o"},null,null,{"$f":"IF(((J12-L12)-(J17-L17))<0,\"+\",IF(((J12-L12)-(J17-L17))=0,\"o\",\"-\"))","v":"o"},null,null,{"$f":"IF(((M12-O12)-(M17-O17))<0,\"+\",IF(((M12-O12)-(M17-O17))=0,\"o\",\"-\"))","v":"o"}]
[0,180,0,0,180,0,0,180,0,0,180,0,0,180,0,null,"-",null,null,"o",null,null,"o",null,null,"o",null,null,"o"]
[0,180,0,0,180,0,0,180,0,0,180,0,0,180,0,null,"o",null,null,"o",null,null,"o",null,null,"o",null,null,"o"]
[0,180,0,0,180,0,0,180,0,0,180,0,0,180,0,null,"-",null,null,"o",null,null,"o",null,null,"o",null,null,"o"]
[0,180,0,0,180,0,0,180,0,0,180,0,0,180,0]
[0,180,0,0,180,0,0,180,0,0,180,0,0,180,0]
[0,160,20,0,180,0,0,180,0,0,180,0,0,180,0]
[0,180,0,0,180,0,0,180,0,0,180,0,0,180,0]
[0,160,20,0,180,0,0,180,0,0,180,0,0,180,0]
[100,80,0,40,140,0,40,140,0,40,140,0,40,140,0,null,{"$f":"IF(((A21-C21)-(A26-C26))<0,\"+\",IF(((A21-C21)-(A26-C26))=0,\"o\",\"-\"))","v":"-"},null,null,{"$f":"IF(((D21-F21)-(D26-F26))<0,\"+\",IF(((D21-F21)-(D26-F26))=0,\"o\",\"-\"))","v":"-"},null,null,{"$f":"IF(((G21-I21)-(G26-I26))<0,\"+\",IF(((G21-I21)-(G26-I26))=0,\"o\",\"-\"))","v":"-"},null,null,{"$f":"IF(((J21-L21)-(J26-L26))<0,\"+\",IF(((J21-L21)-(J26-L26))=0,\"o\",\"-\"))","v":"-"},null,null,{"$f":"IF(((M21-O21)-(M26-O26))<0,\"+\",IF(((M21-O21)-(M26-O26))=0,\"o\",\"-\"))","v":"-"}]
[80,100,0,0,180,0,0,180,0,0,180,0,0,180,0,null,{"$f":"IF(((A22-C22)-(A27-C27))<0,\"+\",IF(((A22-C22)-(A27-C27))=0,\"o\",\"-\"))","v":"-"},null,null,{"$f":"IF(((D22-F22)-(D27-F27))<0,\"+\",IF(((D22-F22)-(D27-F27))=0,\"o\",\"-\"))","v":"o"},null,null,{"$f":"IF(((G22-I22)-(G27-I27))<0,\"+\",IF(((G22-I22)-(G27-I27))=0,\"o\",\"-\"))","v":"o"},null,null,{"$f":"IF(((J22-L22)-(J27-L27))<0,\"+\",IF(((J22-L22)-(J27-L27))=0,\"o\",\"-\"))","v":"o"},null,null,{"$f":"IF(((M22-O22)-(M27-O27))<0,\"+\",IF(((M22-O22)-(M27-O27))=0,\"o\",\"-\"))","v":"o"}]
[80,100,0,0,180,0,0,180,0,0,180,0,0,180,0,null,"-",null,null,"-",null,null,"-",null,null,"-",null,null,"-"]
[80,100,0,0,180,0,0,180,0,0,180,0,0,180,0,null,"-",null,null,"o",null,null,"o",null,null,"o",null,null,"o"]
[80,100,0,0,180,0,0,180,0,0,180,0,0,180,0,null,"-",null,null,"-",null,null,"-",null,null,"-",null,null,"-"]
[80,80,20,0,180,0,0,180,0,0,180,0,0,180,0]
[0,60,120,0,180,0,0,180,0,0,180,0,0,180,0]
[0,60,120,0,160,20,0,160,20,0,160,20,0,160,20]
[0,60,120,0,180,0,0,180,0,0,180,0,0,180,0]
[0,60,120,0,160,20,0,160,20,0,160,20,0,160,20]

{"sheet":"gaussian","index":6,"n_rows":30,"n_cols":29,"rows_kept":30}
[100,80,0,40,140,0,40,140,0,40,140,0,40,140,0,null,{"$f":"IF(((A1-C1)-(A6-C6))<0,\"+\",IF(((A1-C1)-(A6-C6))=0,\"o\",\"-\"))","v":"-"},null,null,{"$f":"IF(((D1-F1)-(D6-F6))<0,\"+\",IF(((D1-F1)-(D6-F6))=0,\"o\",\"-\"))","v":"-"},null,null,{"$f":"IF(((G1-I1)-(G6-I6))<0,\"+\",IF(((G1-I1)-(G6-I6))=0,\"o\",\"-\"))","v":"-"},null,null,{"$f":"IF(((J1-L1)-(J6-L6))<0,\"+\",IF(((J1-L1)-(J6-L6))=0,\"o\",\"-\"))","v":"-"},null,null,{"$f":"IF(((M1-O1)-(M6-O6))<0,\"+\",IF(((M1-O1)-(M6-O6))=0,\"o\",\"-\"))","v":"-"}]
[60,120,0,0,180,0,0,180,0,0,180,0,0,180,0,null,{"$f":"IF(((A2-C2)-(A7-C7))<0,\"+\",IF(((A2-C2)-(A7-C7))=0,\"o\",\"-\"))","v":"-"},null,null,{"$f":"IF(((D2-F2)-(D7-F7))<0,\"+\",IF(((D2-F2)-(D7-F7))=0,\"o\",\"-\"))","v":"o"},null,null,{"$f":"IF(((G2-I2)-(G7-I7))<0,\"+\",IF(((G2-I2)-(G7-I7))=0,\"o\",\"-\"))","v":"o"},null,null,{"$f":"IF(((J2-L2)-(J7-L7))<0,\"+\",IF(((J2-L2)-(J7-L7))=0,\"o\",\"-\"))","v":"o"},null,null,{"$f":"IF(((M2-O2)-(M7-O7))<0,\"+\",IF(((M2-O2)-(M7-O7))=0,\"o\",\"-\"))","v":"o"}]
[80,100,0,0,180,0,0,180,0,0,180,0,0,180,0,null,"-",null,null,"-",null,null,"-",null,null,"-",null,null,"-"]
[80,100,0,0,180,0,0,180,0,0,180,0,0,180,0,null,"-",null,null,"o",null,null,"o",null,null,"o",null,null,"o"]
[80,100,0,0,180,0,0,180,0,0,180,0,0,180,0,null,"-",null,null,"-",null,null,"-",null,null,"-",null,null,"-"]
[40,120,20,0,180,0,0,180,0,0,180,0,0,180,0]
[0,80,100,0,180,0,0,180,0,0,180,0,0,180,0]
[0,60,120,0,160,20,0,160,20,0,160,20,0,160,20]
[0,100,80,0,180,0,0,180,0,0,180,0,0,180,0]
[0,60,120,0,160,20,0,160,20,0,160,20,0,160,20]
[60,120,0,0,180,0,0,180,0,0,180,0,0,180,0,null,{"$f":"IF(((A11-C11)-(A16-C16))<0,\"+\",IF(((A11-C11)-(A16-C16))=0,\"o\",\"-\"))","v":"-"},null,null,{"$f":"IF(((D11-F11)-(D16-F16))<0,\"+\",IF(((D11-F11)-(D16-F16))=0,\"o\",\"-\"))","v":"o"},null,null,{"$f":"IF(((G11-I11)-(G16-I16))<0,\"+\",IF(((G11-I11)-(G16-I16))=0,\"o\",\"-\"))","v":"o"},null,null,{"$f":"IF(((J11-L11)-(J16-L16))<0,\"+\",IF(((J11-L11)-(J16-L16))=0,\"o\",\"-\"))","v":"o"},null,null,{"$f":"IF(((M11-O11)-(M16-O16))<0,\"+\",IF(((M11-O11)-(M16-O16))=0,\"o\",\"-\"))","v":"o"}]
[0,180,0,0,180,0,0,180,0,0,180,0,0,180,0,null,{"$f":"IF(((A12-C12)-(A17-C17))<0,\"+\",IF(((A12-C12)-(A17-C17))=0,\"o\",\"-\"))","v":"o"},null,null,{"$f":"IF(((D12-F12)-(D17-F17))<0,\"+\",IF(((D12-F12)-(D17-F17))=0,\"o\",\"-\"))","v":"o"},null,null,{"$f":"IF(((G12-I12)-(G17-I17))<0,\"+\",IF(((G12-I12)-(G17-I17))=0,\"o\",\"-\"))","v":"o"},null,null,{"$f":"IF(((J12-L12)-(J17-L17))<0,\"+\",IF(((J12-L12)-(J17-L17))=0,\"o\",\"-\"))","v":"o"},null,null,{"$f":"IF(((M12-O12)-(M17-O17))<0,\"+\",IF(((M12-O12)-(M17-O17))=0,\"o\",\"-\"))","v":"o"}]
[0,180,0,0,180,0,0,180,0,0,180,0,0,180,0,null,"-",null,null,"o",null,null,"o",null,null,"o",null,null,"o"]
[0,180,0,0,180,0,0,180,0,0,180,0,0,180,0,null,"-",null,null,"o",null,null,"o",null,null,"o",null,null,"o"]
[0,180,0,0,180,0,0,180,0,0,180,0,0,180,0,null,"-",null,null,"o",null,null,"o",null,null,"o",null,null,"o"]
[0,180,0,0,180,0,0,180,0,0,180,0,0,180,0]
[0,180,0,0,180,0,0,180,0,0,180,0,0,180,0]
[0,160,20,0,180,0,0,180,0,0,180,0,0,180,0]
[0,160,20,0,180,0,0,180,0,0,180,0,0,180,0]
[0,160,20,0,180,0,0,180,0,0,180,0,0,180,0]
[100,80,0,40,140,0,40,140,0,40,140,0,40,140,0,null,{"$f":"IF(((A21-C21)-(A26-C26))<0,\"+\",IF(((A21-C21)-(A26-C26))=0,\"o\",\"-\"))","v":"-"},null,null,{"$f":"IF(((D21-F21)-(D26-F26))<0,\"+\",IF(((D21-F21)-(D26-F26))=0,\"o\",\"-\"))","v":"-"},null,null,{"$f":"IF(((G21-I21)-(G26-I26))<0,\"+\",IF(((G21-I21)-(G26-I26))=0,\"o\",\"-\"))","v":"-"},null,null,{"$f":"IF(((J21-L21)-(J26-L26))<0,\"+\",IF(((J21-L21)-(J26-L26))=0,\"o\",\"-\"))","v":"-"},null,null,{"$f":"IF(((M21-O21)-(M26-O26))<0,\"+\",IF(((M21-O21)-(M26-O26))=0,\"o\",\"-\"))","v":"-"}]
[60,120,0,0,180,0,0,180,0,0,180,0,0,180,0,null,{"$f":"IF(((A22-C22)-(A27-C27))<0,\"+\",IF(((A22-C22)-(A27-C27))=0,\"o\",\"-\"))","v":"-"},null,null,{"$f":"IF(((D22-F22)-(D27-F27))<0,\"+\",IF(((D22-F22)-(D27-F27))=0,\"o\",\"-\"))","v":"o"},null,null,{"$f":"IF(((G22-I22)-(G27-I27))<0,\"+\",IF(((G22-I22)-(G27-I27))=0,\"o\",\"-\"))","v":"o"},null,null,{"$f":"IF(((J22-L22)-(J27-L27))<0,\"+\",IF(((J22-L22)-(J27-L27))=0,\"o\",\"-\"))","v":"o"},null,null,{"$f":"IF(((M22-O22)-(M27-O27))<0,\"+\",IF(((M22-O22)-(M27-O27))=0,\"o\",\"-\"))","v":"o"}]
[80,100,0,0,180,0,0,180,0,0,180,0,0,180,0,null,"-",null,null,"-",null,null,"-",null,null,"-",null,null,"-"]
[80,100,0,0,180,0,0,180,0,0,180,0,0,180,0,null,"-",null,null,"o",null,null,"o",null,null,"o",null,null,"o"]
[80,100,0,0,180,0,0,180,0,0,180,0,0,180,0,null,"-",null,null,"-",null,null,"-",null,null,"-",null,null,"-"]
[40,120,20,0,180,0,0,180,0,0,180,0,0,180,0]
[0,80,100,0,180,0,0,180,0,0,180,0,0,180,0]
[0,60,120,0,160,20,0,160,20,0,160,20,0,160,20]
[0,100,80,0,180,0,0,180,0,0,180,0,0,180,0]
[0,60,120,0,160,20,0,160,20,0,160,20,0,160,20]